{"text_format":"1","workbook":"xlsx","n_sheets":3,"sheets":["Mileage Form","Mileage Chart","Mileage Look Up Table"],"not_rendered":{"charts":0,"images":2,"macros":1,"external_links":0,"defined_names":2,"comments":0,"pivot_tables":0},"unopened":[],"bounds":{"document_bytes":16777216,"sheet_cells":100000,"rows_first":2000,"rows_last":500,"rows_between":2000,"halvings":0,"cell_chars":16384,"cell_head_chars":4096},"cells_cut":0,"cells_raw":0,"read":"whole","date_system":"1900"}

{"sheet":"Mileage Form","index":0,"n_rows":471,"n_cols":13,"rows_kept":471,"cut":false,"hidden":false,"merged":[[30,1,30,2],[30,3,30,5],[23,4,23,5],[24,4,24,5],[41,0,41,3],[40,0,40,3],[31,1,31,2],[31,3,31,5],[37,0,37,3],[35,0,35,2],[32,0,32,12],[37,9,37,10],[35,8,35,11],[31,7,31,10],[0,0,0,12],[1,0,1,12],[8,0,8,5],[8,8,8,12],[6,8,7,12],[2,8,3,12],[4,8,4,12],[5,8,5,12],[3,3,3,7],[6,4,6,7],[4,3,4,7],[5,3,5,7],[17,4,17,5],[21,4,21,5],[22,4,22,5],[18,4,18,5],[19,4,19,5],[20,4,20,5],[13,4,13,5],[14,4,14,5],[15,4,15,5],[16,4,16,5],[7,13,7,17],[7,0,7,5],[10,0,10,1],[9,3,9,5],[9,0,9,2],[12,4,12,5],[10,8,10,12],[9,8,9,12],[10,3,10,4],[11,0,11,12],[44,1,44,2],[45,1,45,2],[33,3,33,5],[34,3,34,5],[34,0,34,2],[39,0,39,3],[39,4,39,8],[34,8,34,11],[39,11,39,12],[33,0,33,2],[39,9,39,10],[37,11,37,12],[35,3,35,5],[37,4,37,8],[33,9,33,11],[42,0,42,3],[28,11,28,12],[25,4,25,5],[26,4,26,5],[29,11,29,12],[31,11,31,12],[29,3,29,5],[30,11,30,12],[27,10,27,11],[27,0,27,6],[30,7,30,10],[29,7,29,10],[29,1,29,2],[27,7,27,8],[28,1,28,2],[28,3,28,5],[28,7,28,10]]}
["ASB Mileage Report"]
["(Type or print in ink)"]
[null,null,null,null,null,null,null,null,"My home address (enter address below)"]
[null,null,null,"Deliver my check to:"]
[null,null,null,"Home address if requesting home delivery:"]
[null,null,null,"City, State, ZIP"]
[]
[]
["Employee Name",null,null,null,null,null,"ID #",null,"School/Department"]
[null,null,null,null,null,null,2020]
["Begin Date",null,"thru","End Date",null,null,"Year",null,"Position"]
["MILEAGE (Enter district locations using mileage chart abbreviations)"]
["Date","From","To","Round Trip\n (Y or N)","Purpose",null,"Mileage","Date","From","To","Round Trip \n(Y or N)","Purpose","Mileage"]
[null,null,null,null,null,null,{"$f":"IF(D14=\"Y\",VLOOKUP(B14&C14,'Mileage Look Up Table'!$C$1:$D$993,2,FALSE)*2,IF(D14=\"N\",VLOOKUP(B14&C14,'Mileage Look Up Table'!$C$1:$D$993,2,FALSE),\"\"))","v":""},null,null,null,null,null,{"$f":"IF(K14=\"Y\",VLOOKUP(I14&J14,'Mileage Look Up Table'!$C$1:$D$993,2,FALSE)*2,IF(K14=\"N\",VLOOKUP(I14&J14,'Mileage Look Up Table'!$C$1:$D$993,2,FALSE),\"\"))","v":""}]
[null,null,null,null,null,null,{"$f":"IF(D15=\"Y\",VLOOKUP(B15&C15,'Mileage Look Up Table'!$C$1:$D$993,2,FALSE)*2,IF(D15=\"N\",VLOOKUP(B15&C15,'Mileage Look Up Table'!$C$1:$D$993,2,FALSE),\"\"))","v":""},null,null,null,null,null,{"$f":"IF(K15=\"Y\",VLOOKUP(I15&J15,'Mileage Look Up Table'!$C$1:$D$993,2,FALSE)*2,IF(K15=\"N\",VLOOKUP(I15&J15,'Mileage Look Up Table'!$C$1:$D$993,2,FALSE),\"\"))","v":""}]
[null,null,null,null,null,null,{"$f":"IF(D16=\"Y\",VLOOKUP(B16&C16,'Mileage Look Up Table'!$C$1:$D$993,2,FALSE)*2,IF(D16=\"N\",VLOOKUP(B16&C16,'Mileage Look Up Table'!$C$1:$D$993,2,FALSE),\"\"))","v":""},null,null,null,null,null,{"$f":"IF(K16=\"Y\",VLOOKUP(I16&J16,'Mileage Look Up Table'!$C$1:$D$993,2,FALSE)*2,IF(K16=\"N\",VLOOKUP(I16&J16,'Mileage Look Up Table'!$C$1:$D$993,2,FALSE),\"\"))","v":""}]
[null,null,null,null,null,null,{"$f":"IF(D17=\"Y\",VLOOKUP(B17&C17,'Mileage Look Up Table'!$C$1:$D$993,2,FALSE)*2,IF(D17=\"N\",VLOOKUP(B17&C17,'Mileage Look Up Table'!$C$1:$D$993,2,FALSE),\"\"))","v":""},null,null,null,null,null,{"$f":"IF(K17=\"Y\",VLOOKUP(I17&J17,'Mileage Look Up Table'!$C$1:$D$993,2,FALSE)*2,IF(K17=\"N\",VLOOKUP(I17&J17,'Mileage Look Up Table'!$C$1:$D$993,2,FALSE),\"\"))","v":""}]
[null,null,null,null,null,null,{"$f":"IF(D18=\"Y\",VLOOKUP(B18&C18,'Mileage Look Up Table'!$C$1:$D$993,2,FALSE)*2,IF(D18=\"N\",VLOOKUP(B18&C18,'Mileage Look Up Table'!$C$1:$D$993,2,FALSE),\"\"))","v":""},null,null,null,null,null,{"$f":"IF(K18=\"Y\",VLOOKUP(I18&J18,'Mileage Look Up Table'!$C$1:$D$993,2,FALSE)*2,IF(K18=\"N\",VLOOKUP(I18&J18,'Mileage Look Up Table'!$C$1:$D$993,2,FALSE),\"\"))","v":""}]
[null,null,null,null,null,null,{"$f":"IF(D19=\"Y\",VLOOKUP(B19&C19,'Mileage Look Up Table'!$C$1:$D$993,2,FALSE)*2,IF(D19=\"N\",VLOOKUP(B19&C19,'Mileage Look Up Table'!$C$1:$D$993,2,FALSE),\"\"))","v":""},null,null,null,null,null,{"$f":"IF(K19=\"Y\",VLOOKUP(I19&J19,'Mileage Look Up Table'!$C$1:$D$993,2,FALSE)*2,IF(K19=\"N\",VLOOKUP(I19&J19,'Mileage Look Up Table'!$C$1:$D$993,2,FALSE),\"\"))","v":""}]
[null,null,null,null,null,null,{"$f":"IF(D20=\"Y\",VLOOKUP(B20&C20,'Mileage Look Up Table'!$C$1:$D$993,2,FALSE)*2,IF(D20=\"N\",VLOOKUP(B20&C20,'Mileage Look Up Table'!$C$1:$D$993,2,FALSE),\"\"))","v":""},null,null,null,null,null,{"$f":"IF(K20=\"Y\",VLOOKUP(I20&J20,'Mileage Look Up Table'!$C$1:$D$993,2,FALSE)*2,IF(K20=\"N\",VLOOKUP(I20&J20,'Mileage Look Up Table'!$C$1:$D$993,2,FALSE),\"\"))","v":""}]
[null,null,null,null,null,null,{"$f":"IF(D21=\"Y\",VLOOKUP(B21&C21,'Mileage Look Up Table'!$C$1:$D$993,2,FALSE)*2,IF(D21=\"N\",VLOOKUP(B21&C21,'Mileage Look Up Table'!$C$1:$D$993,2,FALSE),\"\"))","v":""},null,null,null,null,null,{"$f":"IF(K21=\"Y\",VLOOKUP(I21&J21,'Mileage Look Up Table'!$C$1:$D$993,2,FALSE)*2,IF(K21=\"N\",VLOOKUP(I21&J21,'Mileage Look Up Table'!$C$1:$D$993,2,FALSE),\"\"))","v":""}]
[null,null,null,null,null,null,{"$f":"IF(D22=\"Y\",VLOOKUP(B22&C22,'Mileage Look Up Table'!$C$1:$D$993,2,FALSE)*2,IF(D22=\"N\",VLOOKUP(B22&C22,'Mileage Look Up Table'!$C$1:$D$993,2,FALSE),\"\"))","v":""},null,null,null,null,null,{"$f":"IF(K22=\"Y\",VLOOKUP(I22&J22,'Mileage Look Up Table'!$C$1:$D$993,2,FALSE)*2,IF(K22=\"N\",VLOOKUP(I22&J22,'Mileage Look Up Table'!$C$1:$D$993,2,FALSE),\"\"))","v":""}]
[null,null,null,null,null,null,{"$f":"IF(D23=\"Y\",VLOOKUP(B23&C23,'Mileage Look Up Table'!$C$1:$D$993,2,FALSE)*2,IF(D23=\"N\",VLOOKUP(B23&C23,'Mileage Look Up Table'!$C$1:$D$993,2,FALSE),\"\"))","v":""},null,null,null,null,null,{"$f":"IF(K23=\"Y\",VLOOKUP(I23&J23,'Mileage Look Up Table'!$C$1:$D$993,2,FALSE)*2,IF(K23=\"N\",VLOOKUP(I23&J23,'Mileage Look Up Table'!$C$1:$D$993,2,FALSE),\"\"))","v":""}]
[null,null,null,null,null,null,{"$f":"IF(D24=\"Y\",VLOOKUP(B24&C24,'Mileage Look Up Table'!$C$1:$D$993,2,FALSE)*2,IF(D24=\"N\",VLOOKUP(B24&C24,'Mileage Look Up Table'!$C$1:$D$993,2,FALSE),\"\"))","v":""},null,null,null,null,null,{"$f":"IF(K24=\"Y\",VLOOKUP(I24&J24,'Mileage Look Up Table'!$C$1:$D$993,2,FALSE)*2,IF(K24=\"N\",VLOOKUP(I24&J24,'Mileage Look Up Table'!$C$1:$D$993,2,FALSE),\"\"))","v":""}]
[null,null,null,null,null,null,{"$f":"IF(D25=\"Y\",VLOOKUP(B25&C25,'Mileage Look Up Table'!$C$1:$D$993,2,FALSE)*2,IF(D25=\"N\",VLOOKUP(B25&C25,'Mileage Look Up Table'!$C$1:$D$993,2,FALSE),\"\"))","v":""},null,null,null,null,null,{"$f":"IF(K25=\"Y\",VLOOKUP(I25&J25,'Mileage Look Up Table'!$C$1:$D$993,2,FALSE)*2,IF(K25=\"N\",VLOOKUP(I25&J25,'Mileage Look Up Table'!$C$1:$D$993,2,FALSE),\"\"))","v":""}]
[null,null,null,null,null,null,{"$f":"IF(D26=\"Y\",VLOOKUP(B26&C26,'Mileage Look Up Table'!$C$1:$D$993,2,FALSE)*2,IF(D26=\"N\",VLOOKUP(B26&C26,'Mileage Look Up Table'!$C$1:$D$993,2,FALSE),\"\"))","v":""},null,null,null,null,null,{"$f":"IF(K26=\"Y\",VLOOKUP(I26&J26,'Mileage Look Up Table'!$C$1:$D$993,2,FALSE)*2,IF(K26=\"N\",VLOOKUP(I26&J26,'Mileage Look Up Table'!$C$1:$D$993,2,FALSE),\"\"))","v":""}]
[null,null,null,null,null,null,{"$f":"IF(D27=\"Y\",VLOOKUP(B27&C27,'Mileage Look Up Table'!$C$1:$D$993,2,FALSE)*2,IF(D27=\"N\",VLOOKUP(B27&C27,'Mileage Look Up Table'!$C$1:$D$993,2,FALSE),\"\"))","v":""},null,null,null,null,null,{"$f":"IF(K27=\"Y\",VLOOKUP(I27&J27,'Mileage Look Up Table'!$C$1:$D$993,2,FALSE)*2,IF(K27=\"N\",VLOOKUP(I27&J27,'Mileage Look Up Table'!$C$1:$D$993,2,FALSE),\"\"))","v":""}]
["PARKING AND TOLLS (attach receipts)",null,null,null,null,null,null,"Total Miles",null,{"$f":"SUM(G14:G27)+SUM(M14:M27)","v":0},"x IRS Rate Per Mile",null,{"$f":"IF(G10=2019,B45,IF(G10=2020,B46,\"SELECT YEAR\"))","v":0.57499999999999996}]
["Date","Purpose",null,"Location",null,null,"Amount","Total Mileage:",null,null,null,{"$f":"J28*M28","v":0}]
[null,null,null,null,null,null,null,"Total Parking and Tolls:",null,null,null,{"$f":"SUM(G30:G32)","v":0}]
[]
[null,null,null,null,null,null,null,"TOTAL EXPENSE:",null,null,null,{"$f":"SUM(L29:L30)","v":0}]
["I (the employee) hereby certify under penalty of perjury that this is a true and correct claim for necessary expenses incurred by me and that no payment has been received by me on account thereof."]
["FQA:",null,null,null,null,null,null,null,null,"Total - District Travel (58000)"]
[]
[]
[null,null,null,null,null,null,null,null,null,null,null,"Total:",{"$f":"IF(SUM(M34:M36)=ROUND(L32,2),SUM(M34:M36),\"NOT DONE\")","v":0}]
["Employee Signature:",null,null,null,null,null,null,null,null,"Date:"]
[]
["Activity Advisor Signature:",null,null,null,null,null,null,null,null,"Date:"]
["ASB Treasurer Signature:",null,null,null,null,null,null,null,null,null,"Date:"]
["Primary Advisor Signature:",null,null,null,null,null,null,null,null,null,"Date:"]
["Student Rep Signature:",null,null,null,null,null,null,null,null,null,"Date:"]
[]
[2019,0.57999999999999996]
[2020,0.57499999999999996]
[]
["My home address (enter address below)"]
["Athletics"]
["Cascade High School"]
["Cedar Wood Elementary School"]
["CRC - Accounting"]
["CRC - Budget"]
["CRC - Business Services"]
["CRC - Career and Technical Education"]
["CRC - Categorical Programs"]
["CRC - Communications"]
["CRC - Community Services"]
["CRC - Curriculum and Assessment"]
["CRC - Curriculum Specialists and Support"]
["CRC - Curriculum, Assessment, and Special Programs"]
["CRC - Facilities and Operations"]
["CRC - Facilities and Planning"]
["CRC - Finance and Business Services"]
["CRC - Food and Nutrition Services"]
["CRC - Human Resources"]
["CRC - Information Systems and Technology"]
["CRC - Learning Management Systems"]
["CRC - On-time Graduation"]
["CRC - Payroll"]
["CRC - Purchasing"]
["CRC - Special Services"]
["CRC - Student Support Services"]
["CRC - Substitute Employee Placement"]
["CRC - Superintendent's Office"]
["CRC - Teaching and Learning"]
["CRC - Wellness"]
["Eisenhower Middle School"]
["Emerson Elementary School"]
["Everett High School"]
["Evergreen Middle School"]
["Forest View Elementary School"]
["Garfield Elementary School"]
["Gateway Middle School"]
["Hawthorne Elementary School"]
["Heatherwood Middle School"]
["Henry M. Jackson High School"]
["Jackson Elementary School"]
["James Monroe Elementary School"]
["Jefferson Elementary School"]
["Lowell Elementary School"]
["Madison Elementary School"]
["Maintenance and Operations"]
["Mill Creek Elementary School"]
["North Middle School"]
["Penny Creek Elementary School"]
["Science Resource Center"]
["Sequoia High School/Online/Port Gardner"]
["Silver Firs Elementary School"]
["Silver Lake Elementary School"]
["Tambark Creek Elementary School"]
["Transportation"]
["View Ridge Elementary School"]
["Whittier Elementary School"]
["Woodside Elementary School"]
[]
["January 1"]
["January 2"]
["January 3"]
["January 4"]
["January 5"]
["January 6"]
["January 7"]
["January 8"]
["January 9"]
["January 10"]
["January 11"]
["January 12"]
["January 13"]
["January 14"]
["January 15"]
["January 16"]
["January 17"]
["January 18"]
["January 19"]
["January 20"]
["January 21"]
["January 22"]
["January 23"]
["January 24"]
["January 25"]
["January 26"]
["January 27"]
["January 28"]
["January 29"]
["January 30"]
["January 31"]
["February 1"]
["February 2"]
["February 3"]
["February 4"]
["February 5"]
["February 6"]
["February 7"]
["February 8"]
["February 9"]
["February 10"]
["February 11"]
["February 12"]
["February 13"]
["February 14"]
["February 15"]
["February 16"]
["February 17"]
["February 18"]
["February 19"]
["February 20"]
["February 21"]
["February 22"]
["February 23"]
["February 24"]
["February 25"]
["February 26"]
["February 27"]
["February 28"]
["March 1"]
["March 2"]
["March 3"]
["March 4"]
["March 5"]
["March 6"]
["March 7"]
["March 8"]
["March 9"]
["March 10"]
["March 11"]
["March 12"]
["March 13"]
["March 14"]
["March 15"]
["March 16"]
["March 17"]
["March 18"]
["March 19"]
["March 20"]
["March 21"]
["March 22"]
["March 23"]
["March 24"]
["March 25"]
["March 26"]
["March 27"]
["March 28"]
["March 29"]
["March 30"]
["March 31"]
["April 1"]
["April 2"]
["April 3"]
["April 4"]
{"$rows_left_out":272}
{"sheet":"Mileage Chart","index":1,"n_rows":32,"n_cols":31,"rows_kept":32,"cut":false,"hidden":false,"merged":[]}
["CRC","ATH","MAINT","CW","EM","FV","GA","HA","JA","JE","LO","MA","MC","MO","PC","SF","SL","VR","WH","WO","EIS","EVGN","HWD","GTWY","NOR","CHS","EHS","JHS","SEQ","BUS","LIVELY"]
["CRC",0.4,1.3,11.1,4,12,2,2.9,1.4,4.3,1.2,2.6,8.5,5.3,7.8,10,6.9,2.2000000000000002,2.9,11.4,4.8,4.0999999999999996,8,10.5,1.4,3.8,1.7,7.4,0.8,7.1,10.199999999999999]
[null,"ATH",1.2,11.3,4,12.3,1.9,2.8,1,4.5999999999999996,1.4,2.5,8.8000000000000007,5.6,8.1,10.3,7.3,2.2999999999999998,2.8,11.6,5.0999999999999996,3.7,8.3000000000000007,10.8,1.2,3.6,1.4,7.7,0.6,7.3,10.5]
[null,null,"MAINT",11.9,5.3,12.3,0.7,1.9,1.8,5.5,2.2999999999999998,3.7,10.3,6.9,9.3000000000000007,11.6,8.5,3.4,1.9,12.9,6.4,4.8,9.1,12.1,0.2,4.9000000000000004,0.7,9.1,1.4,8.5,11.6]
[null,null,null,"CW",7.8,2.8,12.1,13.5,12.2,5.8,8.6999999999999993,9,1.6,4.4000000000000004,2.8,3.2,3.6,9.6999999999999993,13.1,0.9,5.2,7.9,3.2,2.5,11.7,7.7,12,3.8,11.1,8.8000000000000007,2.6]
[null,null,null,null,"EM",8.3000000000000007,6.6,7.9,4.5,2.4,2.9,2.4,6,3,5.0999999999999996,7.6,3.5,3,7.6,8.1,2.9,1.3,4.9000000000000004,7.8,6.2,0.5,5.0999999999999996,4.7,4,1.8,7]
[null,null,null,null,null,"FV",13.2,14.3,12,6.8,9.3000000000000007,10.9,2.5,5.4,3.5,1.1000000000000001,4.2,11.4,14.5,3.6,6.2,8.8000000000000007,3.8,0.3,12.6,8.6,12.9,4.0999999999999996,11.6,9.5,3.5]
[null,null,null,null,null,null,"GA",1.2,2.6,6.1,3.1,4.3,11.5,7.2,9.5,13,8.6,4.0999999999999996,2,13.5,6.6,6.1,9.8000000000000007,13.5,0.6,5.5,0.9,9.6,2.2999999999999998,9,12.2]
[null,null,null,null,null,null,null,"HA",3.5,7.1,4,5.7,12.9,8.1,10.4,14.5,10,5.4,0.8,14.4,7.9,6.9,11.2,14.9,1.5,7.2,1.8,11,3,8.1999999999999993,13.5]
[null,null,null,null,null,null,null,null,"JA",5.3,2.2999999999999998,2.5,9.9,6.3,8.6,10.9,8.3000000000000007,1.6,3.5,12.3,5.8,3.5,8.9,12,2,3.6,1.7,8.9,0.5,4.7,11.4]
[null,null,null,null,null,null,null,null,null,"JE",3.2,3.4,4.9000000000000004,1.9,4.0999999999999996,6.5,3,4.3,7.7,7.6,1.3,2.2000000000000002,4.7,6.5,5.4,2.4,6.6,4.7,5.6,3.3,6]
[null,null,null,null,null,null,null,null,null,null,"LO",1.7,7.3,5.4,6.5,8.6,5.3,2.7,3.9,10,3.7,2.8,6.4,9.6,2.2999999999999998,2.6,2.8,6.2,2,4.2,9.3000000000000007]
[null,null,null,null,null,null,null,null,null,null,null,"MA",7.9,4.5,6.8,9.1999999999999993,5.6,1.1000000000000001,5.3,9.8000000000000007,3.8,1.4,6.4,10.9,3.9,2.2000000000000002,3.5,7,2.2999999999999998,2.7,9.6]
[null,null,null,null,null,null,null,null,null,null,null,null,"MC",3.1,1.9,2.9,2.2999999999999998,8.1999999999999993,12,2.2999999999999998,3.9,6.4,1.6,2.2000000000000002,10.199999999999999,6.4,9.8000000000000007,2.2000000000000002,9.1999999999999993,6.9,1.8]
[null,null,null,null,null,null,null,null,null,null,null,null,null,"MO",2.2999999999999998,4.5999999999999996,1.6,5.3,8.6999999999999993,5.0999999999999996,1.6,3.5,3.1,5.0999999999999996,6.9,3.4,6.9,3.1,6.6,4.3,4.5999999999999996]
[null,null,null,null,null,null,null,null,null,null,null,null,null,null,"PC",2.4,1.6,7.9,10.7,3.5,3.1,5.6,2.4,3,9.4,5.5,10.6,1.7,8.6,6.5,3]
[null,null,null,null,null,null,null,null,null,null,null,null,null,null,null,"SF",4,10.3,13.4,4,5.4,8.9,3.7,1,12.6,8,12.3,4.2,11,8.8000000000000007,3.4]
[null,null,null,null,null,null,null,null,null,null,null,null,null,null,null,null,"SL",6.5,9.8000000000000007,4.5,2.5,4.5,1.3,4.3,8.6999999999999993,4.0999999999999996,8.6,1,7.8,5.3,3.4]
[null,null,null,null,null,null,null,null,null,null,null,null,null,null,null,null,null,"VR",5.0999999999999996,11.6,4.5999999999999996,1.6,7.5,11.4,3.6,2.9,3.3,7.5,2.1,3.4,10.3]
[null,null,null,null,null,null,null,null,null,null,null,null,null,null,null,null,null,null,"WH",14.2,8.5,6.5,10.4,14.5,1.8,6.4,1.7,10.4,3,7.9,13.2]
[null,null,null,null,null,null,null,null,null,null,null,null,null,null,null,null,null,null,null,"WO",6.1,9.8000000000000007,4.3,3.3,12.8,9.1999999999999993,13.2,4.0999999999999996,12.6,8.8000000000000007,2.2000000000000002]
[null,null,null,null,null,null,null,null,null,null,null,null,null,null,null,null,null,null,null,null,"EIS",3.1,3.7,5.8,6.5,2.8,6.5,3.7,5.4,3.8,5.4]
[null,null,null,null,null,null,null,null,null,null,null,null,null,null,null,null,null,null,null,null,null,"EVGN",5.5,10,5,1,4.5999999999999996,5.4,3.7,1.9,8.4]
[null,null,null,null,null,null,null,null,null,null,null,null,null,null,null,null,null,null,null,null,null,null,"HWD",3.5,9.5,5.7,9.1,0.6,8.6999999999999993,5.5,2.6]
[null,null,null,null,null,null,null,null,null,null,null,null,null,null,null,null,null,null,null,null,null,null,null,"GTWY",13.2,9.1,13.4,4.5,10.9,9.3000000000000007,3.3]
[null,null,null,null,null,null,null,null,null,null,null,null,null,null,null,null,null,null,null,null,null,null,null,null,"NOR",5,0.7,9.1999999999999993,1.5,6.6,11.8]
[null,null,null,null,null,null,null,null,null,null,null,null,null,null,null,null,null,null,null,null,null,null,null,null,null,"CHS",5,5.7,3.7,1.7,7.8]
[null,null,null,null,null,null,null,null,null,null,null,null,null,null,null,null,null,null,null,null,null,null,null,null,null,null,"EHS",9.1,1.2,6.2,12]
[null,null,null,null,null,null,null,null,null,null,null,null,null,null,null,null,null,null,null,null,null,null,null,null,null,null,null,"JHS",8.4,5.4,3]
[null,null,null,null,null,null,null,null,null,null,null,null,null,null,null,null,null,null,null,null,null,null,null,null,null,null,null,null,"SEQ",5,11.2]
[null,null,null,null,null,null,null,null,null,null,null,null,null,null,null,null,null,null,null,null,null,null,null,null,null,null,null,null,null,"BUS",7.7]
[null,null,null,null,null,null,null,null,null,null,null,null,null,null,null,null,null,null,null,null,null,null,null,null,null,null,null,null,null,null,"LIVELY"]

{"sheet":"Mileage Look Up Table","index":2,"n_rows":993,"n_cols":4,"rows_kept":993,"cut":false,"hidden":false,"merged":[]}
["From","To","Merged","Mileage"]
["CRC","ATH",{"$f":"A2&B2","v":"CRCATH"},0.4]
["CRC","MAINT",{"$f":"A3&B3","v":"CRCMAINT"},1.3]
["CRC","CW","CRCCW",11.1]
["CRC","EM","CRCEM",4]
["CRC","FV","CRCFV",12]
["CRC","GA","CRCGA",2]
["CRC","HA","CRCHA",2.9]
["CRC","JA","CRCJA",1.4]
["CRC","JE","CRCJE",4.3]
["CRC","LO","CRCLO",1.2]
["CRC","MA ","CRCMA ",2.6]
["CRC","MC","CRCMC",8.5]
["CRC","MO","CRCMO",5.3]
["CRC","PC","CRCPC",7.8]
["CRC","SF","CRCSF",10]
["CRC","SL","CRCSL",6.9]
["CRC","TC","CRCTC",11.5]
["CRC","VR","CRCVR",2.2000000000000002]
["CRC","WH","CRCWH",2.9]
["CRC","WO","CRCWO",11.4]
["CRC","EIS","CRCEIS",4.8]
["CRC","EVGN","CRCEVGN",4.0999999999999996]
["CRC","HWD","CRCHWD",8]
["CRC","GTWY","CRCGTWY",10.5]
["CRC","NOR","CRCNOR",1.4]
["CRC","CHS","CRCCHS",3.8]
["CRC","EHS","CRCEHS",1.7]
["CRC","JHS","CRCJHS",7.4]
["CRC","SEQ","CRCSEQ",0.8]
["CRC","BUS","CRCBUS",7.1]
["CRC","LIVELY","CRCLIVELY",10.199999999999999]
["ATH","CRC","ATHCRC",0.4]
["ATH","MAINT","ATHMAINT",1.2]
["ATH","CW","ATHCW",11.3]
["ATH","EM","ATHEM",4]
["ATH","FV","ATHFV",12.3]
["ATH","GA","ATHGA",1.9]
["ATH","HA","ATHHA",2.8]
["ATH","JA","ATHJA",1]
["ATH","JE","ATHJE",4.5999999999999996]
["ATH","LO","ATHLO",1.4]
["ATH","MA ","ATHMA ",2.5]
["ATH","MC","ATHMC",8.8000000000000007]
["ATH","MO","ATHMO",5.6]
["ATH","PC","ATHPC",8.1]
["ATH","SF","ATHSF",10.3]
["ATH","SL","ATHSL",7.3]
["ATH","TC","ATHTC",11.9]
["ATH","VR","ATHVR",2.2999999999999998]
["ATH","WH","ATHWH",2.8]
["ATH","WO","ATHWO",11.6]
["ATH","EIS","ATHEIS",5.0999999999999996]
["ATH","EVGN","ATHEVGN",3.7]
["ATH","HWD","ATHHWD",8.3000000000000007]
["ATH","GTWY","ATHGTWY",10.8]
["ATH","NOR","ATHNOR",1.2]
["ATH","CHS","ATHCHS",3.6]
["ATH","EHS","ATHEHS",1.4]
["ATH","JHS","ATHJHS",7.7]
["ATH","SEQ","ATHSEQ",0.6]
["ATH","BUS","ATHBUS",7.3]
["ATH","LIVELY","ATHLIVELY",10.5]
["MAINT","CRC","MAINTCRC",1.3]
["MAINT","ATH","MAINTATH",1.2]
["MAINT","CW","MAINTCW",11.9]
["MAINT","EM","MAINTEM",5.3]
["MAINT","FV","MAINTFV",12.3]
["MAINT","GA",{"$f":"A69&B69","v":"MAINTGA"},0.7]
["MAINT","HA","MAINTHA",1.9]
["MAINT","JA","MAINTJA",1.8]
["MAINT","JE","MAINTJE",5.5]
["MAINT","LO","MAINTLO",2.2999999999999998]
["MAINT","MA ","MAINTMA ",3.7]
["MAINT","MC","MAINTMC",10.3]
["MAINT","MO","MAINTMO",6.9]
["MAINT","PC","MAINTPC",9.3000000000000007]
["MAINT","SF","MAINTSF",11.6]
["MAINT","SL","MAINTSL",8.5]
["MAINT","TC","MAINTTC",12.8]
["MAINT","VR","MAINTVR",3.4]
["MAINT","WH","MAINTWH",1.9]
["MAINT","WO","MAINTWO",12.9]
["MAINT","EIS","MAINTEIS",6.4]
["MAINT","EVGN","MAINTEVGN",4.8]
["MAINT","HWD","MAINTHWD",9.1]
["MAINT","GTWY","MAINTGTWY",12.1]
["MAINT","NOR","MAINTNOR",0.2]
["MAINT","CHS","MAINTCHS",4.9000000000000004]
["MAINT","EHS","MAINTEHS",0.7]
["MAINT","JHS","MAINTJHS",9.1]
["MAINT","SEQ","MAINTSEQ",1.4]
["MAINT","BUS","MAINTBUS",8.5]
["MAINT","LIVELY","MAINTLIVELY",11.6]
["CW","CRC","CWCRC",11.1]
["CW","ATH","CWATH",11.3]
["CW","MAINT","CWMAINT",11.9]
["CW","EM","CWEM",7.8]
["CW","FV","CWFV",2.8]
["CW","GA","CWGA",12.1]
["CW","HA","CWHA",13.5]
["CW","JA","CWJA",12.2]
["CW","JE","CWJE",5.8]
["CW","LO","CWLO",8.6999999999999993]
["CW","MA ","CWMA ",9]
["CW","MC","CWMC",1.6]
["CW","MO","CWMO",4.4000000000000004]
["CW","PC","CWPC",2.8]
["CW","SF","CWSF",3.2]
["CW","TC","CWTC",1.5]
["CW","SL","CWSL",3.6]
["CW","VR","CWVR",9.6999999999999993]
["CW","WH","CWWH",13.1]
["CW","WO","CWWO",0.9]
["CW","EIS","CWEIS",5.2]
["CW","EVGN","CWEVGN",7.9]
["CW","HWD","CWHWD",3.2]
["CW","GTWY","CWGTWY",2.5]
["CW","NOR","CWNOR",11.7]
["CW","CHS","CWCHS",7.7]
["CW","EHS","CWEHS",12]
["CW","JHS","CWJHS",3.8]
["CW","SEQ","CWSEQ",11.1]
["CW","BUS","CWBUS",8.8000000000000007]
["CW","LIVELY","CWLIVELY",2.6]
["EM","CRC","EMCRC",4]
["EM","ATH","EMATH",4]
["EM","MAINT","EMMAINT",5.3]
["EM","CW","EMCW",7.8]
["EM","FV","EMFV",8.3000000000000007]
["EM","GA","EMGA",6.6]
["EM","HA","EMHA",7.9]
["EM","JA","EMJA",4.5]
["EM","JE","EMJE",2.4]
["EM","LO",{"$f":"A135&B135","v":"EMLO"},2.9]
["EM","MA ","EMMA ",2.4]
["EM","MC","EMMC",6]
["EM","MO","EMMO",3]
["EM","PC","EMPC",5.0999999999999996]
["EM","SF","EMSF",7.6]
["EM","SL","EMSL",3.5]
["EM","TC","EMTC",8.1999999999999993]
["EM","VR","EMVR",3]
["EM","WH","EMWH",7.6]
["EM","WO","EMWO",8.1]
["EM","EIS","EMEIS",2.9]
["EM","EVGN","EMEVGN",1.3]
["EM","HWD","EMHWD",4.9000000000000004]
["EM","GTWY","EMGTWY",7.8]
["EM","NOR","EMNOR",6.2]
["EM","CHS","EMCHS",0.5]
["EM","EHS","EMEHS",5.0999999999999996]
["EM","JHS","EMJHS",4.7]
["EM","SEQ","EMSEQ",4]
["EM","BUS","EMBUS",1.8]
["EM","LIVELY","EMLIVELY",7]
["FV","CRC","FVCRC",12]
["FV","ATH","FVATH",12.3]
["FV","MAINT","FVMAINT",12.3]
["FV","CW","FVCW",2.8]
["FV","EM","FVEM",8.3000000000000007]
["FV","GA","FVGA",13.2]
["FV","HA","FVHA",14.3]
["FV","JA","FVJA",12]
["FV","JE","FVJE",6.8]
["FV","LO","FVLO",9.3000000000000007]
["FV","MA ","FVMA ",10.9]
["FV","MC","FVMC",2.5]
["FV","MO","FVMO",5.4]
["FV","PC","FVPC",3.5]
["FV","SF","FVSF",1.1000000000000001]
["FV","SL","FVSL",4.2]
["FV","TC","FVTC",2.7]
["FV","VR","FVVR",11.4]
["FV","WH","FVWH",14.5]
["FV","WO","FVWO",3.6]
["FV","EIS","FVEIS",6.2]
["FV","EVGN","FVEVGN",8.8000000000000007]
["FV","HWD","FVHWD",3.8]
["FV","GTWY","FVGTWY",0.3]
["FV","NOR","FVNOR",12.6]
["FV","CHS","FVCHS",8.6]
["FV","EHS","FVEHS",12.9]
["FV","JHS","FVJHS",4.0999999999999996]
["FV","SEQ","FVSEQ",11.6]
["FV","BUS","FVBUS",9.5]
["FV","LIVELY","FVLIVELY",3.5]
["GA","CRC","GACRC",2]
["GA","ATH","GAATH",1.9]
["GA","MAINT","GAMAINT",0.7]
["GA","CW","GACW",12.1]
["GA","EM","GAEM",6.6]
["GA","FV","GAFV",13.2]
["GA","HA","GAHA",1.2]
["GA","JA","GAJA",2.6]
["GA","JE","GAJE",6.1]
["GA","LO","GALO",3.1]
["GA","MA ","GAMA ",4.3]
["GA","MC","GAMC",11.5]
["GA","MO","GAMO",7.2]
{"$rows_left_out":793}